{"text_format":"1","workbook":"xlsx","n_sheets":3,"sheets":["CRONOGRAMA","FISICO","BDI"],"not_rendered":{"charts":0,"images":0,"macros":1,"external_links":1,"defined_names":0,"comments":0,"pivot_tables":0},"unopened":[],"bounds":{"document_bytes":16777216,"sheet_cells":100000,"rows_first":2000,"rows_last":500,"rows_between":2000,"halvings":0,"cell_chars":16384,"cell_head_chars":4096},"cells_cut":0,"cells_raw":0,"read":"whole","date_system":"1900"}

{"sheet":"CRONOGRAMA","index":0,"n_rows":179,"n_cols":12,"rows_kept":179,"cut":false,"hidden":false,"merged":[]}
[]
[]
[]
[]
[]
[]
[]
[]
[]
[]
[]
[]
[null,null,"TODOS OS VALORES ESTÃO NA UNIDADE MONETÁRIA REAL"]
[null,null,"ITEM ","SERVIÇO ","UN","QUANT.","VALOR \n(S/ BDI)","BDI","VALOR \n(C/ BDI)","VALOR TOTAL","CÓDIGO ","FONTE"]
[null,null,1,{"$f":"[1]QUANT!C8","v":"CANTEIRO DE OBRA"},null,null,null,null,"∑ ",{"$f":"J16","v":450}]
[null,null,"1.1",{"$f":"[1]QUANT!C9","v":"Placa de Obra em Lona com quadro de madeira"},"M2",{"$f":"ROUND([1]QUANT!E9,2)","v":2.88},75,{"$f":"[1]BDI!$C$31","v":0.2034},{"$f":"ROUND(((G16*H16)+G16),2)","v":90.26},450,"MED200","MERCADO"]
[null,null,2,"DEMOLIÇÃO",null,null,null,null,"∑ ",{"$f":"SUM(J19:J24)","v":5525.09}]
[null,null,"2.1","Parede de Alvenaria"]
[null,null,"2.1.1","Remoção de parede - mão de obra","M3",1.46,157.63999999999999,0.2034,{"$f":"ROUND(((G19*H19)+G19),2)","v":189.7},{"$f":"IF(ISERR(ROUND(ROUND(F19,2)*I29,2)),\"\",ROUND(ROUND(F19,2)*I19,2))","v":276.95999999999998},97623,"SINAPI-C"]
[null,null,"2.1.2","Remoção de porta/janela (0,80 x 2,40m) - mão de obra","M2",2.02,250,0.2034,{"$f":"ROUND(((G20*H20)+G20),2)","v":300.85000000000002},{"$f":"IF(ISERR(ROUND(ROUND(F20,2)*I30,2)),\"\",ROUND(ROUND(F20,2)*I20,2))","v":607.72},"MED201","MERCADO"]
[null,null,"2.1.3","Remoção de janela alumínio e vidro (5,86 x 1,10m) - mão de obra","M2",6.77,500,0.2034,{"$f":"ROUND(((G21*H21)+G21),2)","v":601.70000000000005},{"$f":"IF(ISERR(ROUND(ROUND(F21,2)*I31,2)),\"\",ROUND(ROUND(F21,2)*I21,2))","v":4073.51},"MED202","MERCADO"]
[null,null,"2.1.4","Remoção de janela alumínio e vidro (1,00 x 1,10m) - mão de obra","M2",1.1599999999999999,250,0.2034,{"$f":"ROUND(((G22*H22)+G22),2)","v":300.85000000000002},348.99,"MED203","MERCADO"]
[null,null,"2.1.5","Remoção de Telhamento","M2",16.66,4,0.2034,4.8099999999999996,80.13,97649,"SINAPI-C"]
[null,null,"2.1.6","Remoção de Estrutura de Madeira do Telhado","M2",16.66,6.87,0.2034,{"$f":"ROUND(((G24*H24)+G24),2)","v":8.27},137.78,97650,"SINAPI-C"]
[null,null,3,{"$f":"[1]QUANT!C27","v":"INFRAESTRUTURA"},null,null,null,null,"∑ ",{"$f":"SUM(J27:J42)","v":13704.099999999999}]
[null,null,"3.1","Escavação"]
[null,null,"3.1.1","Escavação Manual para Bloco/Sapata, com previsão de fôrma","M3",2.54,90.65,{"$f":"[1]BDI!$C$31","v":0.2034},{"$f":"ROUND(((G27*H27)+G27),2)","v":109.09},{"$f":"IF(ISERR(ROUND(ROUND(F27,2)*I27,2)),\"\",ROUND(ROUND(F27,2)*I27,2))","v":277.08999999999997},96523,"SINAPI-C"]
[null,null,"3.1.2","Escavação Manual para Viga Baldrame, com previsão de fôrma","M3",2.59,118.94,{"$f":"[1]BDI!$C$31","v":0.2034},{"$f":"ROUND(((G28*H28)+G28),2)","v":143.13},370.71,96527,"SINAPI-C"]
[null,null,"3.2","Lastro de Brita Graduada"]
[null,null,"3.2.1","Lastro de Brita Graduada para Fundo de Valas das Fundações, esp.=5cm","M3",0.57999999999999996,190.68,{"$f":"[1]BDI!$C$31","v":0.2034},{"$f":"ROUND(((G30*H30)+G30),2)","v":229.46},{"$f":"IF(ISERR(ROUND(ROUND(F30,2)*I30,2)),\"\",ROUND(ROUND(F30,2)*I30,2))","v":133.09},96621,"SINAPI-C"]
[null,null,"3.3","Fôrma",null,""]
[null,null,"3.3.1","Fôrma de Madeira para Concreto (material e mão-de-obra para fabricação, montagem e desforma) - Blocos de Coroamento e Pilares de Fundação","M2",8.57,121.92,{"$f":"[1]BDI!$C$31","v":0.2034},{"$f":"ROUND(((G32*H32)+G32),2)","v":146.72},{"$f":"IF(ISERR(ROUND(ROUND(F32,2)*I32,2)),\"\",ROUND(ROUND(F32,2)*I32,2))","v":1257.3900000000001},"CED005","COMPOSIÇÃO"]
[null,null,"3.3.2","Fôrma de Madeira para Concreto, (material e mão-de-obra para fabricação, montagem e desforma) - Vigas Baldrame","M2",24.18,60.94,{"$f":"[1]BDI!$C$31","v":0.2034},{"$f":"ROUND(((G33*H33)+G33),2)","v":73.34},1773.36,"CED007","COMPOSIÇÃO"]
[null,null,"3.4","Armadura",null,""]
[null,null,"3.4.1","Armadura CA-50 - 8.0mm (fornecimento, corte, dobra e colocação)","KG",58.1,17.010000000000002,{"$f":"[1]BDI!$C$31","v":0.2034},{"$f":"ROUND(((G35*H35)+G35),2)","v":20.47},{"$f":"IF(ISERR(ROUND(ROUND(F35,2)*I35,2)),\"\",ROUND(ROUND(F35,2)*I35,2))","v":1189.31},96545,"SINAPI-C"]
[null,null,"3.4.2","Armadura CA-50 - 10.0mm (fornecimento, corte, dobra e colocação)","KG",138,15.83,{"$f":"[1]BDI!$C$31","v":0.2034},19.05,2628.9,96546,"SINAPI-C"]
[null,null,"3.4.3","Armadura CA-50 - 12.5mm (fornecimento, corte, dobra e colocação)","KG",46.4,13.34,{"$f":"[1]BDI!$C$31","v":0.2034},16.05,744.72,96547,"SINAPI-C"]
[null,null,"3.4.4","Armadura CA-60 - 5.0mm (fornecimento, corte, dobra e colocação)","KG",49,18.91,{"$f":"[1]BDI!$C$31","v":0.2034},{"$f":"ROUND(((G38*H38)+G38),2)","v":22.76},1115.24,96543,"SINAPI-C"]
[null,null,"3.5","Concreto",null,""]
[null,null,"3.5.1","Concreto Feito no Local, Fck= 25MPa (fornecimento, lançamento, adensamento e bombeado)","M3",5.13,527.01,{"$f":"[1]BDI!$C$31","v":0.2034},{"$f":"ROUND(((G40*H40)+G40),2)","v":634.20000000000005},{"$f":"IF(ISERR(ROUND(ROUND(F40,2)*I40,2)),\"\",ROUND(ROUND(F40,2)*I40,2))","v":3253.45},"CED002","COMPOSIÇÃO"]
[null,null,"3.6","Impermeabilização",null,""]
[null,null,"3.6.1","Impermeabilização das Vigas Baldrames com Manta Asfáltica e=3mm, incluindo Emulsão Asfáltica","M2",8.4700000000000006,94.27,{"$f":"[1]BDI!$C$31","v":0.2034},{"$f":"ROUND(((G42*H42)+G42),2)","v":113.44},{"$f":"IF(ISERR(ROUND(ROUND(F42,2)*I42,2)),\"\",ROUND(ROUND(F42,2)*I42,2))","v":960.84},98546,"SINAPI-C"]
[null,null,4,{"$f":"[1]QUANT!C31","v":"SUPRAESTRUTURA"},null,"",null,null,"∑ ",{"$f":"SUM(J45,J46,J48,J49,J50,J51,J52,J54,J55)","v":10098.839999999998}]
[null,null,"4.1","Fôrma",null,""]
[null,null,"4.1.1","Fôrma de Madeira Serrada para Concreto, (material e mão-de-obra para fabricação, montagem e desforma) - Pilares","M2",21.17,88.16,{"$f":"[1]BDI!$C$31","v":0.2034},{"$f":"ROUND(((G45*H45)+G45),2)","v":106.09},{"$f":"IF(ISERR(ROUND(ROUND(F45,2)*I45,2)),\"\",ROUND(ROUND(F45,2)*I45,2))","v":2245.9299999999998},"CED008","COMPOSIÇÃO"]
[null,null,"4.1.2","Fôrma de Madeira Serrada para Concreto, (material e mão-de-obra para fabricação, montagem e desforma) - Vigas Superiores","M2",21.57,104.89,{"$f":"[1]BDI!$C$31","v":0.2034},{"$f":"ROUND(((G46*H46)+G46),2)","v":126.22},2722.57,"CED009","COMPOSIÇÃO"]
[null,null,"4.2","Armadura",null,""]
[null,null,"4.2.1","Armadura CA-50 - 8.0mm (fornecimento, corte, dobra e colocação)","KG",15.7,17.71,{"$f":"[1]BDI!$C$31","v":0.2034},{"$f":"ROUND(((G48*H48)+G48),2)","v":21.31},{"$f":"IF(ISERR(ROUND(ROUND(F48,2)*I48,2)),\"\",ROUND(ROUND(F48,2)*I48,2))","v":334.57},92777,"SINAPI-C"]
[null,null,"4.2.2","Armadura CA-50 - 10.0mm (fornecimento, corte, dobra e colocação)","KG",62.4,15.76,{"$f":"[1]BDI!$C$31","v":0.2034},18.97,1183.73,92778,"SINAPI-C"]
[null,null,"4.2.3","Armadura CA-50 - 12.5mm (fornecimento, corte, dobra e colocação)","KG",12.4,13.2,{"$f":"[1]BDI!$C$31","v":0.2034},15.88,196.91,92779,"SINAPI-C"]
[null,null,"4.2.4","Armadura CA-60 - 5.0mm (fornecimento, corte, dobra e colocação)","KG",40.200000000000003,19.010000000000002,{"$f":"[1]BDI!$C$31","v":0.2034},{"$f":"ROUND(((G51*H51)+G51),2)","v":22.88},919.78,92775,"SINAPI-C"]
[null,null,"4.2.5","Armadura CA-50 - 6.3mm (fornecimento, corte, dobra e colocação)","KG",18.7,19.010000000000002,{"$f":"[1]BDI!$C$31","v":0.2034},{"$f":"ROUND(((G52*H52)+G52),2)","v":22.88},427.86,92776,"SINAPI-C"]
[null,null,"4.3","Concreto",null,""]
[null,null,"4.3.1","Concreto Feito no Local, Fck= 25MPa (fornecimento, lançamento, adensamento e bombeado) - Pilares","M3",1.64,527.01,{"$f":"[1]BDI!$C$31","v":0.2034},{"$f":"ROUND(((G54*H54)+G54),2)","v":634.20000000000005},{"$f":"IF(ISERR(ROUND(ROUND(F54,2)*I54,2)),\"\",ROUND(ROUND(F54,2)*I54,2))","v":1040.0899999999999},"CED002","COMPOSIÇÃO"]
[null,null,"4.3.2","Concreto Usinado, Fck= 25MPa (fornecimento, lançamento, adensamento e bombeado) - Vigas","M3",1.62,527.01,{"$f":"[1]BDI!$C$31","v":0.2034},{"$f":"ROUND(((G55*H55)+G55),2)","v":634.20000000000005},{"$f":"IF(ISERR(ROUND(ROUND(F55,2)*I55,2)),\"\",ROUND(ROUND(F55,2)*I55,2))","v":1027.4000000000001},"CED003","COMPOSIÇÃO"]
[null,null,5,{"$f":"[1]QUANT!C35","v":"FECHAMENTOS"},null,"",null,null,"∑ ",{"$f":"SUM(J58,J60)","v":4763.8}]
[null,null,"5.1","Alvenaria de Tijolos Cerâmicos",null,""]
[null,null,"5.1.1","Alvenaria de Vedação de Rijolo Ceramico Furados Tijolo 11,5x19x24cm, 8 Furos, Assentamento Cutelo (fornecimento e assentamento, incluso argamassa)","M2",57.07,61.24,{"$f":"[1]BDI!$C$31","v":0.2034},{"$f":"ROUND(((G58*H58)+G58),2)","v":73.7},{"$f":"IF(ISERR(ROUND(ROUND(F58,2)*I58,2)),\"\",ROUND(ROUND(F58,2)*I58,2))","v":4206.0600000000004},"CED033","COMPOSIÇÃO"]
[null,null,"5.2","Contra-Vergas ",null,""]
[null,null,"5.2.1",{"$f":"[1]QUANT!C109","v":"Vergas, moldadas no local, h=20cm (incluso Fôrmas, Concreto e Armadura) "},"M",9.1,50.93,{"$f":"[1]BDI!$C$31","v":0.2034},{"$f":"ROUND(((G60*H60)+G60),2)","v":61.29},{"$f":"IF(ISERR(ROUND(ROUND(F60,2)*I60,2)),\"\",ROUND(ROUND(F60,2)*I60,2))","v":557.74},"CED030","COMPOSIÇÃO"]
[null,null,6,{"$f":"[1]QUANT!C149","v":"ESTRUTURA COBERTURA"},null,"",null,null,"∑ ",{"$f":"SUM(J62,J63)","v":9889}]
[null,null,"6.1","Estrutura Pontaletada em Madeira Não Aparelhada para Telha Cerâmica, composta por Pontaletes, Mão Francesa e Berço (fabricação e instalação)","M2",116,23.38,{"$f":"[1]BDI!$C$31","v":0.2034},{"$f":"ROUND(((G62*H62)+G62),2)","v":28.14},{"$f":"IF(ISERR(ROUND(ROUND(F62,2)*I62,2)),\"\",ROUND(ROUND(F62,2)*I62,2))","v":3264.24},"CED050","COMPOSIÇÃO"]
[null,null,"6.2","Trama de Pinus Tratado, composta por:\n- Ripas 3x6cm à cada 32cm\n- Caibros 6x12cm à cada 70cm\n- Terças 7x15cm à cada 220cm","M2",116,47.46,{"$f":"[1]BDI!$C$31","v":0.2034},{"$f":"ROUND(((G63*H63)+G63),2)","v":57.11},{"$f":"IF(ISERR(ROUND(ROUND(F63,2)*I63,2)),\"\",ROUND(ROUND(F63,2)*I63,2))","v":6624.76},"CED052","COMPOSIÇÃO"]
[null,null,7,{"$f":"[1]QUANT!C153","v":"TELHAMENTO"},null,"",null,null,"∑ ",{"$f":"SUM(J65,J66)","v":5212.2199999999993}]
[null,null,"7.1",{"$f":"[1]QUANT!C155","v":"Telha Cerâmica tipo Portuguesa, Esmaltada (fornecimento e instalação)"},"M2",116,33.979999999999997,{"$f":"[1]BDI!$C$31","v":0.2034},{"$f":"ROUND(((G65*H65)+G65),2)","v":40.89},{"$f":"IF(ISERR(ROUND(ROUND(F65,2)*I65,2)),\"\",ROUND(ROUND(F65,2)*I65,2))","v":4743.24},94195,"SINAPI-C"]
[null,null,"7.2",{"$f":"[1]QUANT!C160","v":"Cumeeiras/Espigão Cerâmica, Emboçada com Argamassa (fornecimento e instalação)"},"M",13.02,29.93,{"$f":"[1]BDI!$C$31","v":0.2034},{"$f":"ROUND(((G66*H66)+G66),2)","v":36.020000000000003},468.98,94219,"SINAPI-C"]
[null,null,8,{"$f":"[1]QUANT!C194","v":"CALHAS E RUFOS"},null,"",null,null,"∑ ",{"$f":"SUM(J68,J69)","v":3831.5600000000004}]
[null,null,"8.1",{"$f":"[1]QUANT!C201","v":"Calha Platibanda em Chapa em Aço Galvanizado, em Chapa 24 (e=0,65mm)"},"M",26.04,100.3,{"$f":"[1]BDI!$C$31","v":0.2034},{"$f":"ROUND(((G68*H68)+G68),2)","v":120.7},{"$f":"IF(ISERR(ROUND(ROUND(F68,2)*I68,2)),\"\",ROUND(ROUND(F68,2)*I68,2))","v":3143.03},94227,"SINAPI-C"]
[null,null,"8.2",{"$f":"[1]QUANT!C207","v":"Rufo Capa em Chapa em Aço Galvanizado, em Chapa 24 (e=0,65mm)"},"M",9.8699999999999992,57.97,{"$f":"[1]BDI!$C$31","v":0.2034},{"$f":"ROUND(((G69*H69)+G69),2)","v":69.760000000000005},688.53,94231,"SINAPI-C"]
[null,null,9,{"$f":"[1]QUANT!C225","v":"PISO CONVENCIONAL"},null,"",null,null,"∑ ",{"$f":"SUM(J71:J76)","v":9847.75}]
[null,null,"9.1","Regularização e Apiloamento Manual","M2",97.45,2.93,{"$f":"[1]BDI!$C$31","v":0.2034},{"$f":"ROUND(((G71*H71)+G71),2)","v":3.53},{"$f":"IF(ISERR(ROUND(ROUND(F71,2)*I71,2)),\"\",ROUND(ROUND(F71,2)*I71,2))","v":344},"CED060","COMPOSIÇÃO"]
[null,null,"9.2","Compactação Mecânica de Solo, com o Uso de Compactador a Percussão","M2",97.45,3.07,{"$f":"[1]BDI!$C$31","v":0.2034},3.69,359.59,97083,"SINAPI-C"]
[null,null,"9.3","Lastro de Brita Graduada, e=20cm","M3",19.489999999999998,113.85,{"$f":"[1]BDI!$C$31","v":0.2034},137.01,2670.32,100324,"SINAPI-C"]
[null,null,"9.4","Lona 200 Micras (fornecimento e instalação)","M2",97.45,2.98,{"$f":"[1]BDI!$C$31","v":0.2034},3.59,349.85,97087,"SINAPI-C"]
[null,null,"9.5","Tela Soldada Q-92 (fornecimento, corte e colocação com espaçador)","M2",97.45,23.7,{"$f":"[1]BDI!$C$31","v":0.2034},28.52,2779.27,"CED061","COMPOSIÇÃO"]
[null,null,"9.6","Piso de Concreto Usinado, e= 7cm, Fck= 25MPa (fornecimento, lançamento, adensamento, bombeamento e sarrafeamento)","M3",6.83,406.94,{"$f":"[1]BDI!$C$31","v":0.2034},489.71,3344.72,"CED003","COMPOSIÇÃO"]
[null,null,10,{"$f":"[1]QUANT!C233","v":"INSTALAÇÕES ELÉTRICAS"},null,null,null,null,"∑ ",{"$f":"SUM(J79:J94)","v":5812.2500000000009}]
[null,null,"10.1","Infraestrutura do Ramal de Carga e Aterramento"]
[null,null,"10.1.1","Eletroduto PVC Rígido 1.1/2\" (fornecimento e instalação)","M",15.75,16.71,{"$f":"[1]BDI!$C$31","v":0.2034},{"$f":"ROUND(((G79*H79)+G79),2)","v":20.11},{"$f":"IF(ISERR(ROUND(ROUND(F79,2)*I79,2)),\"\",ROUND(ROUND(F79,2)*I79,2))","v":316.73},93008,"SINAPI-C"]
[null,null,"10.2","Fiação do Ramal de Carga e Aterramento"]
{"$rows_left_out":100}
{"sheet":"FISICO","index":1,"n_rows":39,"n_cols":12,"rows_kept":39,"cut":false,"hidden":false,"merged":[[13,9,14,9],[13,11,14,11],[13,0,14,0],[13,1,14,1],[13,2,14,2],[13,3,14,3],[13,5,14,5],[13,7,14,7]]}
[]
[]
[]
[]
[]
[]
[]
[]
[]
[]
[]
[]
["TODOS OS VALORES ESTÃO NA UNIDADE MONETÁRIA REAL"]
["ITEM ","DESCRIÇÃO ","TOTAL","%",1,"%",2,"%",3,"%",4,"%"]
[null,null,null,null,{"$f":"E14*30","v":30},null,{"$f":"G14*30","v":60},null,{"$f":"I14*30","v":90},null,{"$f":"K14*30","v":120}]
[]
[1,"CANTEIRO DE OBRAS",{"$f":"CRONOGRAMA!J15","v":450},{"$f":"C17/$C$38","v":3.7544133128492546E-3},{"$f":"C17*F17","v":450},1,{"$f":"C17*H17","v":0},0,{"$f":"C17*J17","v":0},0,{"$f":"C17*L17","v":0},0]
[2,"DEMOLIÇÃO",{"$f":"CRONOGRAMA!J17","v":5525.09},4.6096603223756201E-2,{"$f":"C18*F18","v":5525.09},1,{"$f":"C18*H18","v":0},0,{"$f":"C18*J18","v":0},0,{"$f":"C18*L18","v":0},0]
[3,"INFRAESTRUTURA",{"$f":"CRONOGRAMA!J25","v":13704.099999999999},0.11433523440137215,13704.099999999999,1,0,{"$f":"1-F19","v":0},0,0,0,0]
[4,"SUPRAESTRUTURA",{"$f":"CRONOGRAMA!J43","v":10098.839999999998},8.4256042978521239E-2,0,0,10098.839999999998,1,0,0,0,0]
[5,"FECHAMENTOS",{"$f":"CRONOGRAMA!J56","v":4763.8},3.9745053643891734E-2,0,0,4763.8,1,0,0,0,0]
[6,"ESTRUTURA COBERTURA",{"$f":"CRONOGRAMA!J61","v":9889},8.2505318335036174E-2,0,0,0,0,9889,1,0,0]
[7,"TELHAMENTO",{"$f":"CRONOGRAMA!J64","v":5212.2199999999993},4.3486284794442533E-2,0,0,0,0,5212.2199999999993,1,0,0]
[8,"CALHAS E RUFOS",{"$f":"CRONOGRAMA!J67","v":3831.5600000000004},3.1967244162179317E-2,0,0,0,null,0,0,3831.5600000000004,1]
[9,"PISO CONVENCIONAL",{"$f":"CRONOGRAMA!J70","v":9847.75},8.2161163781358335E-2,0,0,4923.875,0.5,4923.875,0.5,0,0]
[10,"INSTALAÇÕES ELÉTRICAS",{"$f":"CRONOGRAMA!J77","v":5812.2500000000009},4.8492419505795741E-2,0,0,0,0,2906.1250000000005,0.5,2906.1250000000005,0.5]
[11,"REDE HIDRÁULICA ",{"$f":"CRONOGRAMA!J95","v":1118.5},9.3318028676042022E-3,0,0,559.25,0.5,559.25,0.5,0,0]
[12,"REDE SANITÁRIA",{"$f":"CRONOGRAMA!J106","v":2734.67},2.2815736564998825E-2,2734.67,1,0,0,0,0,0,0]
[13,"REDE PLUVIAL",{"$f":"CRONOGRAMA!J116","v":4376.6100000000006},3.6514672998109288E-2,4376.6100000000006,1,0,0,0,0,0,0]
[14,"INSTALAÇÕES DE AR-CONDICIONADO",{"$f":"CRONOGRAMA!J126","v":274.64},2.2913601605353763E-3,0,null,0,0,274.64,1,0,0]
[15,"REVESTIMENTO ARGAMASSADO",{"$f":"CRONOGRAMA!J133","v":11085.93},9.2491473727366533E-2,0,0,0,0,11085.93,1,0,0]
[16,"REVESTIMENTO DE ACABAMENTO",{"$f":"CRONOGRAMA!J142","v":9842.86},8.2120365823358701E-2,0,0,0,0,1968.5720000000001,0.2,{"$f":"C32*L32","v":7874.2880000000005},0.8]
[17,"PINTURA",{"$f":"CRONOGRAMA!J149","v":3411.9100000000003},2.8466045169430004E-2,0,0,0,0,0,0,3411.9100000000003,1]
[18,"FORRO",{"$f":"CRONOGRAMA!J153","v":14527.26},0.12120297409604992,0,0,0,0,0,0,14527.26,1]
[19,"ESQUADRIAS DE ALUMÍNIO",{"$f":"CRONOGRAMA!J157","v":3037.37},2.5341205253442089E-2,0,0,0,0,0,0,3037.37,1]
[20,"ACESSÓRIOS DO PREVENTIVO CONTRA INCÊNDIO",{"$f":"CRONOGRAMA!J161","v":314.58000000000004},2.6245851999024861E-3,0,0,0,0,0,0,314.58000000000004,1]
[]
[null,"SUBTOTAL",{"$f":"SUM(C16:C37)","v":119858.93999999999},{"$f":"SUM(D17:D37)","v":1},{"$f":"SUM(E17:E37)","v":26790.47},{"$f":"E38/C38","v":0.22351666050108573},{"$f":"SUM(G17:G37)","v":20345.764999999999},{"$f":"G38/C38","v":0.16974757994689427},{"$f":"SUM(I17:I37)","v":36819.612000000001},{"$f":"I38/C38","v":0.3071912032594315},{"$f":"SUM(K17:K37)","v":35903.093000000008},{"$f":"K38/C38","v":0.29954455629258869}]
[null,"TOTAL ACUMULADO",null,null,{"$f":"C39+E38","v":26790.47},0.22351666050108573,47136.235000000001,0.39326424044798003,83955.847000000009,0.70045544370741153,119858.94000000002,1.0000000000000002]

{"sheet":"BDI","index":2,"n_rows":63,"n_cols":14,"rows_kept":63,"cut":false,"hidden":false,"merged":[[13,11,14,13],[13,7,14,9],[3,7,3,9],[2,7,2,9],[55,7,55,9],[56,7,57,9],[60,1,60,4],[45,7,46,9],[24,11,25,13],[23,11,23,13],[24,7,25,9],[23,7,23,9],[34,1,34,4],[36,1,36,4],[39,1,41,1],[39,3,41,3],[44,1,44,4],[46,1,46,4],[28,1,28,4],[13,1,13,4],[2,1,2,4],[4,1,4,4],[7,1,9,1],[7,3,9,3],[12,1,12,4]]}
[]
[]
[null,"O valor do BDI é obtido pela fórmula e taxas abaixo:",null,null,null,null,null,"ADMINISTRAÇÃO LOCAL"]
[null,null,null,null,null,null,null,"1 Quartil"]
[null,"FÓRMULA BDI "]
[]
[]
[null,"BDI ="," (1+AC+S+R+G) (1+DF) (1+L)  ",-1]
[null,null,"_______________________________________            "]
[null,null,"(1-I)"]
[]
[]
[null,"Tipo de Obra:"]
[null,{"$f":"H14","v":"CONSTRUÇÃO DE EDIFÍCIOS"},null,null,null,null,null,"CONSTRUÇÃO DE EDIFÍCIOS",null,null,null,"CONSTRUÇÃO DE RODOVIAS E FERROVIAS (PRAÇAS)"]
[]
[]
[null,"ONDE (Conforme Acórdão do TCU N°2622/2013):",null,null,null,null,null,"1 Quartil","Médio","3 Quartil",null,"1 Quartil","Médio","3 Quartil"]
[null,"AC =  Taxa de Administração Central",null,null,{"$f":"H18","v":0.03},null,null,{"$f":"'[1]FONTE BDI'!C16","v":0.03},{"$f":"'[1]FONTE BDI'!D16","v":0.04},{"$f":"'[1]FONTE BDI'!E16","v":5.5E-2},null,{"$f":"'[1]FONTE BDI'!C25","v":3.7999999999999999E-2},{"$f":"'[1]FONTE BDI'!D25","v":4.0099999999999997E-2},{"$f":"'[1]FONTE BDI'!E25","v":4.6699999999999998E-2}]
[null,"S = Taxa de Seguros",null,null,{"$f":"H19","v":4.0000000000000001E-3},null,null,{"$f":"'[1]FONTE BDI'!C17/2","v":4.0000000000000001E-3},{"$f":"'[1]FONTE BDI'!D17/2","v":4.0000000000000001E-3},{"$f":"'[1]FONTE BDI'!E17/2","v":5.0000000000000001E-3},null,{"$f":"'[1]FONTE BDI'!C26/2","v":1.6000000000000001E-3},{"$f":"'[1]FONTE BDI'!D26/2","v":2E-3},{"$f":"'[1]FONTE BDI'!E26/2","v":3.7000000000000002E-3}]
[null,"G = Taxa de Garantias",null,null,{"$f":"H20","v":4.0000000000000001E-3},null,null,{"$f":"'[1]FONTE BDI'!C17/2","v":4.0000000000000001E-3},{"$f":"'[1]FONTE BDI'!D17/2","v":4.0000000000000001E-3},{"$f":"'[1]FONTE BDI'!E17/2","v":5.0000000000000001E-3},null,{"$f":"'[1]FONTE BDI'!C26/2","v":1.6000000000000001E-3},{"$f":"'[1]FONTE BDI'!D26/2","v":2E-3},{"$f":"'[1]FONTE BDI'!E26/2","v":3.7000000000000002E-3}]
[null,"R = Taxa de Riscos",null,null,{"$f":"H21","v":9.7000000000000003E-3},null,null,{"$f":"'[1]FONTE BDI'!C18","v":9.7000000000000003E-3},{"$f":"'[1]FONTE BDI'!D18","v":1.2699999999999999E-2},{"$f":"'[1]FONTE BDI'!E18","v":1.2699999999999999E-2},null,{"$f":"'[1]FONTE BDI'!C27","v":5.0000000000000001E-3},{"$f":"'[1]FONTE BDI'!D27","v":5.5999999999999999E-3},{"$f":"'[1]FONTE BDI'!E27","v":9.7000000000000003E-3}]
[null,"DF = Taxa de Despesas Financeiras",null,null,{"$f":"H22","v":5.8999999999999999E-3},null,null,{"$f":"'[1]FONTE BDI'!C19","v":5.8999999999999999E-3},{"$f":"'[1]FONTE BDI'!D19","v":1.23E-2},{"$f":"'[1]FONTE BDI'!E19","v":1.3899999999999999E-2},null,{"$f":"'[1]FONTE BDI'!C28","v":1.0200000000000001E-2},{"$f":"'[1]FONTE BDI'!D28","v":1.11E-2},{"$f":"'[1]FONTE BDI'!E28","v":1.21E-2}]
[null,"L = Taxa de Lucro / Remuneração",null,null,{"$f":"IF(ROUNDUP((((1+H31)*(1-E24))/((1+E18+E19+E20+E21)*(1+E22))-1),4)<H23,H23,ROUNDUP((((1+H31)*(1-E24))/((1+E18+E19+E20+E21)*(1+E22))-1),4))","v":6.6000000000000003E-2},null,null,{"$f":"'[1]FONTE BDI'!C20","v":6.1600000000000002E-2},{"$f":"'[1]FONTE BDI'!D20","v":7.3999999999999996E-2},{"$f":"'[1]FONTE BDI'!E20","v":8.9599999999999999E-2},null,{"$f":"'[1]FONTE BDI'!C29","v":6.6400000000000001E-2},{"$f":"'[1]FONTE BDI'!D29","v":7.2999999999999995E-2},{"$f":"'[1]FONTE BDI'!E29","v":8.6900000000000005E-2}]
[null,"I = Taxa de Incidência de Impostos",null,null,{"$f":"D27","v":6.6500000000000004E-2},null,null,"Conforme legislação específica",null,null,null,"Conforme legislação específica"]
[null,null,"I1: PIS e COFINS",3.6499999999999998E-2,null,null,null,{"$f":"'[1]DADOS GERAIS'!$B$3","v":"Prefeitura Municipal de Vitor Meireles"},null,null,null,{"$f":"'[1]DADOS GERAIS'!$B$3","v":"Prefeitura Municipal de Vitor Meireles"}]
[null,null,"I2: ISSQN (conforme legislação municipal)",{"$f":"VLOOKUP(H25,'[1]FONTE BDI'!G14:H41,2,FALSE)","v":0.03}]
[null,null,"∑",{"$f":"SUM(D25:D26)","v":6.6500000000000004E-2}]
[]
[null,"Logo, obtem-se com os dados na fórmula o seguinte resultado:"]
[null,null,null,null,null,null,null,"1 Quartil","Médio","3 Quartil",null,"1 Quartil","Médio","3 Quartil"]
[null,null,{"$f":"TRUNC(((((1+E18+E19+E20+E21)*(1+E22)*(1+E23))/(1-E24))-1),4)","v":0.2034},null,null,null,null,{"$f":"'[1]FONTE BDI'!C5","v":0.2034},{"$f":"'[1]FONTE BDI'!D5","v":0.22120000000000001},{"$f":"'[1]FONTE BDI'!E5","v":0.25},null,{"$f":"'[1]FONTE BDI'!C6","v":0.19600000000000001},{"$f":"'[1]FONTE BDI'!D6","v":0.2097},{"$f":"'[1]FONTE BDI'!E6","v":0.24229999999999999}]
[]
[null,null,null,null,null,null,null,{"$f":"IF(COUNTIF([1]ORÇAMENTO!O:O,C63)<>0,\"Utilizado\",\"\")","v":{"$error":"#VALUE!"}}]
[]
[null,"O valor do BDI é obtido pela fórmula e taxas abaixo:"]
[]
[null,"FÓRMULA BDI "]
[]
[]
[null,"BDI ="," (1+AC+S+R+G) (1+DF) (1+L)  ",-1]
[null,null,"_______________________________________            "]
[null,null,"(1-I)"]
[]
[]
[null,"Tipo de Obra:"]
[null,null,null,null,null,null,null,"FORNECIMENTO DE MATERIAIS E EQUIPAMENTOS"]
[null,"FORNECIMENTO DE MATERIAIS E EQUIPAMENTOS"]
[]
[null,"ONDE (Conforme Acórdão do TCU N°2622/2013):",null,null,null,null,null,"1 Quartil","Médio","3 Quartil"]
[null,"AC =  Taxa de Administração Central",null,null,{"$f":"H50","v":1.4999999999999999E-2},null,null,{"$f":"'[1]FONTE BDI'!C61","v":1.4999999999999999E-2},{"$f":"'[1]FONTE BDI'!D61","v":3.4500000000000003E-2},{"$f":"'[1]FONTE BDI'!E61","v":4.4900000000000002E-2}]
[null,"S = Taxa de Seguros",null,null,1.5E-3,null,null,{"$f":"'[1]FONTE BDI'!C62/2","v":1.5E-3},{"$f":"'[1]FONTE BDI'!D62/2","v":2.3999999999999998E-3},{"$f":"'[1]FONTE BDI'!E62/2","v":4.1000000000000003E-3}]
[null,"G = Taxa de Garantias",null,null,1.5E-3,null,null,{"$f":"'[1]FONTE BDI'!C62/2","v":1.5E-3},{"$f":"'[1]FONTE BDI'!D62/2","v":2.3999999999999998E-3},{"$f":"'[1]FONTE BDI'!E62/2","v":4.1000000000000003E-3}]
[null,"R = Taxa de Riscos",null,null,5.5999999999999999E-3,null,null,{"$f":"'[1]FONTE BDI'!C63","v":5.5999999999999999E-3},{"$f":"'[1]FONTE BDI'!D63","v":8.5000000000000006E-3},{"$f":"'[1]FONTE BDI'!E63","v":8.8999999999999999E-3}]
[null,"DF = Taxa de Despesas Financeiras",null,null,8.5000000000000006E-3,null,null,{"$f":"'[1]FONTE BDI'!C64","v":8.5000000000000006E-3},{"$f":"'[1]FONTE BDI'!D64","v":8.5000000000000006E-3},{"$f":"'[1]FONTE BDI'!E64","v":1.11E-2}]
[null,"L = Taxa de Lucro / Remuneração",null,null,3.5000000000000003E-2,null,null,{"$f":"'[1]FONTE BDI'!C65","v":3.5000000000000003E-2},{"$f":"'[1]FONTE BDI'!D65","v":5.11E-2},{"$f":"'[1]FONTE BDI'!E65","v":6.2199999999999998E-2}]
[null,"I = Taxa de Incidência de Impostos",null,null,{"$f":"D59","v":6.6500000000000004E-2},null,null,"Conforme legislação específica"]
[null,null,"I1: PIS e COFINS",3.6499999999999998E-2,null,null,null,{"$f":"'[1]DADOS GERAIS'!$B$3","v":"Prefeitura Municipal de Vitor Meireles"}]
[null,null,"I2: ISSQN (conforme legislação municipal)",{"$f":"VLOOKUP(H57,'[1]FONTE BDI'!G14:H41,2,FALSE)","v":0.03}]
[null,null,"∑",{"$f":"SUM(D57:D58)","v":6.6500000000000004E-2}]
[]
[null,"Logo, obtem-se com os dados na fórmula o seguinte resultado:"]
[null,null,null,null,null,null,null,"1 Quartil","Médio","3 Quartil"]
[null,null,{"$f":"TRUNC(((((1+E50+E51+E52+E53)*(1+E54)*(1+E55))/(1-E56))-1),4)","v":0.14449999999999999},null,null,null,null,{"$f":"'[1]FONTE BDI'!C10","v":0.111},{"$f":"'[1]FONTE BDI'!D10","v":0.14019999999999999},{"$f":"'[1]FONTE BDI'!E10","v":0.16800000000000001}]